BDBM50254698 5-(1-cyclohexylvinyl)-4-(3,4-dimethylphenyl)-6-methyl-4,7-dihydro-3aH-indene::CHEMBL465277
SMILES CC1=Nc2ccnn2C(C1C(=O)N1CCCCC1)c1ccc(Cl)c(Cl)c1
InChI Key InChIKey=SXWDHNRVHZUHBO-UHFFFAOYSA-N
Data  1 IC50
  Tab Delimited (TSV)   2D SDfile   Computed 3D by Vconf -m prep SDfile
Find this compound or compounds like it in BindingDB:
Activity Spreadsheet -- Enzyme Inhibition Constant Data from BindingDB
Found 1 hit for monomerid = 50254698
TargetPotassium voltage-gated channel subfamily A member 5(Homo sapiens (Human))
Bristol-Myers Squibb
Curated by ChEMBL
LigandPNGBDBM50254698(5-(1-cyclohexylvinyl)-4-(3,4-dimethylphenyl)-6-met...)
Affinity DataIC50:  90nM. Assay description: Inhibition of human Kv1.5 channel expressed in mouse L929 cells by EP voltage clamp technique
In DepthDetails ArticlePubMed