BDBM50254738 4-cyclopropyl-6-(2,5-dichlorophenylamino)-N-((tetrahydro-2H-pyran-4-yl)methyl)nicotinamide::CHEMBL479628
SMILES Clc1ccc(Cl)c(Nc2cc(C3CC3)c(cn2)C(=O)NCC2CCOCC2)c1
InChI Key InChIKey=QKRGRWXDVSZBQO-UHFFFAOYSA-N
Data  5 IC50
  Tab Delimited (TSV)   2D SDfile   Computed 3D by Vconf -m prep SDfile
Find this compound or compounds like it in BindingDB:
Activity Spreadsheet -- Enzyme Inhibition Constant Data from BindingDB
Found 5 hits for monomerid = 50254738
TargetCytochrome P450 2D6(Homo sapiens (Human))
Glaxosmithkline
Curated by ChEMBL
LigandPNGBDBM50254738(4-cyclopropyl-6-(2,5-dichlorophenylamino)-N-((tetr...)
Affinity DataIC50:  4.20E+4nM. Assay description: Inhibition of CYP2D6 (unknown origin)
In DepthDetails ArticlePubMed
TargetCytochrome P450 3A4(Homo sapiens (Human))
Glaxosmithkline
Curated by ChEMBL
LigandPNGBDBM50254738(4-cyclopropyl-6-(2,5-dichlorophenylamino)-N-((tetr...)
Affinity DataIC50: >1.00E+5nM. Assay description: Inhibition of CYP3A4 (unknown origin)
In DepthDetails ArticlePubMed
TargetCytochrome P450 2C19(Homo sapiens (Human))
Glaxosmithkline
Curated by ChEMBL
LigandPNGBDBM50254738(4-cyclopropyl-6-(2,5-dichlorophenylamino)-N-((tetr...)
Affinity DataIC50:  4.90E+4nM. Assay description: Inhibition of CYP2C19 (unknown origin)
In DepthDetails ArticlePubMed
TargetCytochrome P450 1A2(Homo sapiens (Human))
Glaxosmithkline
Curated by ChEMBL
LigandPNGBDBM50254738(4-cyclopropyl-6-(2,5-dichlorophenylamino)-N-((tetr...)
Affinity DataIC50:  5.30E+4nM. Assay description: Inhibition of CYP1A2 (unknown origin).
In DepthDetails ArticlePubMed
TargetCytochrome P450 2C9(Homo sapiens (Human))
Glaxosmithkline
Curated by ChEMBL
LigandPNGBDBM50254738(4-cyclopropyl-6-(2,5-dichlorophenylamino)-N-((tetr...)
Affinity DataIC50:  2.70E+4nM. Assay description: Inhibition of CYP2C9 (unknown origin)
In DepthDetails ArticlePubMed