BDBM50254935 1-Benzyl-8-(2-hydroxy-1-methyl-ethyl)-7-methyl-1H,8Himidazo[2,1-f]purine-2,4-dione::CHEMBL518703
SMILES CC(CO)n1c(C)cn2c1nc1n(Cc3ccccc3)c(=O)[nH]c(=O)c21
InChI Key InChIKey=CWLRKKMZXCWJEO-UHFFFAOYSA-N
Data  3 KI  1 IC50
  Tab Delimited (TSV)   2D SDfile   Computed 3D by Vconf -m prep SDfile
Find this compound or compounds like it in BindingDB:
Activity Spreadsheet -- Enzyme Inhibition Constant Data from BindingDB
Found 4 hits for monomerid = 50254935
TargetAdenosine receptor A3(Homo sapiens (Human))
Università
Curated by ChEMBL
LigandPNGBDBM50254935(1-Benzyl-8-(2-hydroxy-1-methyl-ethyl)-7-methyl-1H,...)
Affinity DataKi: >1.00E+3nM. Assay description: Displacement of [3H]MRE3008F20 from human cloned adenosine A3 receptor expressed in CHO cells
In DepthDetails ArticlePubMed
TargetAdenosine receptor A2a(Homo sapiens (Human))
Università
Curated by ChEMBL
LigandPNGBDBM50254935(1-Benzyl-8-(2-hydroxy-1-methyl-ethyl)-7-methyl-1H,...)
Affinity DataKi: >1.00E+3nM. Assay description: Displacement of [3H]ZM241385 from human cloned adenosine A2A receptor expressed in CHO cells
In DepthDetails ArticlePubMed
TargetAdenosine receptor A1(Homo sapiens (Human))
Università
Curated by ChEMBL
LigandPNGBDBM50254935(1-Benzyl-8-(2-hydroxy-1-methyl-ethyl)-7-methyl-1H,...)
Affinity DataKi: >1.00E+3nM. Assay description: Displacement of [3H]DPCPX from human cloned adenosine A1 receptor expressed in CHO cells
In DepthDetails ArticlePubMed
TargetAdenosine receptor A2b(Homo sapiens (Human))
Università
Curated by ChEMBL
LigandPNGBDBM50254935(1-Benzyl-8-(2-hydroxy-1-methyl-ethyl)-7-methyl-1H,...)
Affinity DataIC50: >1.00E+3nM. Assay description: Antagonist activity at human cloned adenosine A2B cells expressed in CHO cells assessed as inhibition of NECA-stimulated cAMP production
In DepthDetails ArticlePubMed