BDBM50255148 (R)-N1-{(+/-)-4-[(6'-aminopyridin-2'-yl)methyl]pyrrolidin-3-yl}-3-phenylpropane-1,2-diamine tetrachloride::CHEMBL482003
SMILES N[C@@H](CN[C@@H]1CNC[C@@H]1Cc1cccc(N)n1)Cc1ccccc1
InChI Key InChIKey=DOAKWAVPWDYBCX-LZLYRXPVSA-N
Data  3 KI
  Tab Delimited (TSV)   2D SDfile   Computed 3D by Vconf -m prep SDfile
Find this compound or compounds like it in BindingDB:
Activity Spreadsheet -- Enzyme Inhibition Constant Data from BindingDB
Found 3 hits for monomerid = 50255148
TargetNitric oxide synthase, brain(Rattus norvegicus (rat))
Northwestern University
Curated by ChEMBL
LigandPNGBDBM50255148((R)-N1-{(+/-)-4-[(6'-aminopyridin-2'-yl)methyl]pyr...)
Affinity DataKi:  2.42E+3nM. Assay description: Inhibition of rat recombinant nNOS expressed in Escherichia coli by hemoglobin capture assay
In DepthDetails ArticlePubMed
TargetNitric oxide synthase, inducible(Mus musculus (mouse))
Northwestern University
Curated by ChEMBL
LigandPNGBDBM50255148((R)-N1-{(+/-)-4-[(6'-aminopyridin-2'-yl)methyl]pyr...)
Affinity DataKi:  2.38E+5nM. Assay description: Inhibition of mouse recombinant iNOS expressed in Escherichia coli by hemoglobin capture assay
In DepthDetails ArticlePubMed
TargetNitric oxide synthase, endothelial(Bos taurus (bovine))
Northwestern University
Curated by ChEMBL
LigandPNGBDBM50255148((R)-N1-{(+/-)-4-[(6'-aminopyridin-2'-yl)methyl]pyr...)
Affinity DataKi:  1.45E+6nM. Assay description: Inhibition of bovine recombinant eNOS expressed in Escherichia coli by hemoglobin capture assay
In DepthDetails ArticlePubMed