BDBM50255189 2-(3,5-Dimethylpyrazol-1-yl)-6-((R)-2-methoxymethylpyrrolidin-1-yl)pyrimidin-4-ylamine::CHEMBL482213
SMILES COC[C@H]1CCCN1c1cc(N)nc(n1)-n1nc(C)cc1C
InChI Key InChIKey=JYIMVDSGZBYVOH-GFCCVEGCSA-N
Data  2 KI
  Tab Delimited (TSV)   2D SDfile   Computed 3D by Vconf -m prep SDfile
Find this compound or compounds like it in BindingDB:
Activity Spreadsheet -- Enzyme Inhibition Constant Data from BindingDB
Found 2 hits for monomerid = 50255189
TargetAdenosine receptor A2a(Homo sapiens (Human))
Neurocrine Biosciences
Curated by ChEMBL
LigandPNGBDBM50255189(2-(3,5-Dimethylpyrazol-1-yl)-6-((R)-2-methoxymethy...)
Affinity DataKi:  261nM. Assay description: Displacement of [3H]ZM241385 from human adenosine A2A receptor expressed in HEK293 cells
In DepthDetails ArticlePubMed
TargetAdenosine receptor A1(Homo sapiens (Human))
Neurocrine Biosciences
Curated by ChEMBL
LigandPNGBDBM50255189(2-(3,5-Dimethylpyrazol-1-yl)-6-((R)-2-methoxymethy...)
Affinity DataKi:  2.47E+3nM. Assay description: Displacement of [3H]DPCPX from human adenosine A1 receptor expressed in HEK293 cells
In DepthDetails ArticlePubMed