BDBM50255247 1-[2-(3,5-Dimethylpyrazol-1-yl)-6-((R)-2-methoxymethylpyrrolidin-1-yl)pyrimidin-4-yl]-3-isopropylurea::CHEMBL481817
SMILES COC[C@H]1CCCN1c1cc(NC(=O)NC(C)C)nc(n1)-n1nc(C)cc1C
InChI Key InChIKey=MTZHACHOHNFIFR-OAHLLOKOSA-N
Data  2 KI
  Tab Delimited (TSV)   2D SDfile   Computed 3D by Vconf -m prep SDfile
Find this compound or compounds like it in BindingDB:
Activity Spreadsheet -- Enzyme Inhibition Constant Data from BindingDB
Found 2 hits for monomerid = 50255247
TargetAdenosine receptor A2a(Homo sapiens (Human))
Neurocrine Biosciences
Curated by ChEMBL
LigandPNGBDBM50255247(1-[2-(3,5-Dimethylpyrazol-1-yl)-6-((R)-2-methoxyme...)
Affinity DataKi:  43nM. Assay description: Displacement of [3H]ZM241385 from human adenosine A2A receptor expressed in HEK293 cells
In DepthDetails ArticlePubMed
TargetAdenosine receptor A1(Homo sapiens (Human))
Neurocrine Biosciences
Curated by ChEMBL
LigandPNGBDBM50255247(1-[2-(3,5-Dimethylpyrazol-1-yl)-6-((R)-2-methoxyme...)
Affinity DataKi:  1.28E+3nM. Assay description: Displacement of [3H]DPCPX from human adenosine A1 receptor expressed in HEK293 cells
In DepthDetails ArticlePubMed