BDBM50258258 CHEMBL4083192
SMILES Cc1cnc2c(cnn2c1)C(=O)NC1CCc2ccccc12
InChI Key InChIKey=XRUURHUNHZFRCJ-UHFFFAOYSA-N
Data  1 IC50
  Tab Delimited (TSV)   2D SDfile   Computed 3D by Vconf -m prep SDfile
Find this compound or compounds like it in BindingDB:
Activity Spreadsheet -- Enzyme Inhibition Constant Data from BindingDB
Found 1 hit for monomerid = 50258258
TargetcGMP-dependent 3',5'-cyclic phosphodiesterase(Homo sapiens (Human))
Takeda Pharmaceutical
Curated by ChEMBL
LigandPNGBDBM50258258(CHEMBL4083192)
Affinity DataIC50:  4.90E+4nM. Assay description: Inhibition of full length recombinant human His-tagged PDE2A3 expressed in fall armyworm Sf9 cells using [3H]cGMP as substrate preincubated for 30 mi...
Ligand InfoPC cidPC sid
In DepthDetails ArticlePubMed