BDBM50258260 CHEMBL4079320
SMILES COc1cccc(CNC(=O)c2cnn3cc(C)cnc23)c1
InChI Key InChIKey=AKVFOYFUVUJANO-UHFFFAOYSA-N
Data  1 IC50
  Tab Delimited (TSV)   2D SDfile   Computed 3D by Vconf -m prep SDfile
Find this compound or compounds like it in BindingDB:
Activity Spreadsheet -- Enzyme Inhibition Constant Data from BindingDB
Found 1 hit for monomerid = 50258260
TargetcGMP-dependent 3',5'-cyclic phosphodiesterase(Homo sapiens (Human))
Takeda Pharmaceutical
Curated by ChEMBL
LigandPNGBDBM50258260(CHEMBL4079320)
Affinity DataIC50: >1.00E+5nM. Assay description: Inhibition of full length recombinant human His-tagged PDE2A3 expressed in fall armyworm Sf9 cells using [3H]cGMP as substrate preincubated for 30 mi...
In DepthDetails ArticlePubMed