BDBM50258296 CHEMBL4074901
SMILES CCC(N(C)C(=O)c1cnn2cc(C)cnc12)c1ccc(OC)cc1
InChI Key InChIKey=XAMWMZAKWJIJBL-UHFFFAOYSA-N
Data  1 IC50
  Tab Delimited (TSV)   2D SDfile   Computed 3D by Vconf -m prep SDfile
Find this compound or compounds like it in BindingDB:
Activity Spreadsheet -- Enzyme Inhibition Constant Data from BindingDB
Found 1 hit for monomerid = 50258296
TargetcGMP-dependent 3',5'-cyclic phosphodiesterase(Homo sapiens (Human))
Takeda Pharmaceutical
Curated by ChEMBL
LigandPNGBDBM50258296(CHEMBL4074901)
Affinity DataIC50: >1.00E+5nM. Assay description: Inhibition of full length recombinant human His-tagged PDE2A3 expressed in fall armyworm Sf9 cells using [3H]cGMP as substrate preincubated for 30 mi...
In DepthDetails ArticlePubMed