BDBM50258740 CHEMBL4085844
SMILES Cc1cccc(c1)-c1cccc(NC(=O)Nc2ccc(Cl)cc2)c1
InChI Key InChIKey=DJCOLFWPTCLXNV-UHFFFAOYSA-N
Data  2 IC50
  Tab Delimited (TSV)   2D SDfile   Computed 3D by Vconf -m prep SDfile
Find this compound or compounds like it in BindingDB:
Activity Spreadsheet -- Enzyme Inhibition Constant Data from BindingDB
Found 2 hits for monomerid = 50258740
TargetCannabinoid receptor 1(Homo sapiens (Human))
Research Triangle Institute
Curated by ChEMBL
LigandPNGBDBM50258740(CHEMBL4085844)
Affinity DataIC50:  74nM. Assay description: Allosteric modulation of human CB1 receptor expressed in CHO cells co-expressing Galpha16 assessed as inhibition of CP55,940-induced calcium mobiliza...
In DepthDetails ArticlePubMed
TargetCannabinoid receptor 2(MOUSE)
Research Triangle Institute
Curated by ChEMBL
LigandPNGBDBM50258740(CHEMBL4085844)
Affinity DataIC50:  459nM. Assay description: Allosteric modulation of CB1 receptor in CD-1 mouse cerebellar membranes assessed as inhibition of CP55,940-induced [35S]GTPgammaS binding after 60 m...
In DepthDetails ArticlePubMed