BDBM50258766 CHEMBL4077975
SMILES [O-][N+](=O)c1cccc(c1)-c1cccc(NC(=O)Nc2ccc(Cl)cc2)c1
InChI Key InChIKey=JSKYMIIYLFUZTE-UHFFFAOYSA-N
Data  5 IC50
  Tab Delimited (TSV)   2D SDfile   Computed 3D by Vconf -m prep SDfile
Find this compound or compounds like it in BindingDB:
Activity Spreadsheet -- Enzyme Inhibition Constant Data from BindingDB
Found 5 hits for monomerid = 50258766
TargetCannabinoid receptor 2(MOUSE)
Research Triangle Institute
Curated by ChEMBL
LigandPNGBDBM50258766(CHEMBL4077975)
Affinity DataIC50:  452nM. Assay description: Allosteric modulation of CB1 receptor in CD-1 mouse cerebellar membranes assessed as inhibition of CP55,940-induced [35S]GTPgammaS binding after 60 m...
In DepthDetails ArticlePubMed
TargetCannabinoid receptor 2(Homo sapiens (Human))
Research Triangle Institute
Curated by ChEMBL
LigandPNGBDBM50258766(CHEMBL4077975)
Affinity DataIC50: >1.00E+4nM. Assay description: Antagonist activity at human CB2 receptor expressed in CHO cells co-expressing Galpha16 assessed as inhibition of CP55,940-induced calcium mobilizati...
In DepthDetails ArticlePubMed
TargetCannabinoid receptor 1(Homo sapiens (Human))
Usona Institute
Curated by ChEMBL
LigandPNGBDBM50258766(CHEMBL4077975)
Affinity DataIC50:  452nM. Assay description: Allosteric modulation of CB1 receptor (unknown origin) assessed as inhibition of CP55940-induced [35S]GTPgammaS binding
In DepthDetails ArticlePubMed
TargetCannabinoid receptor 1(Homo sapiens (Human))
Usona Institute
Curated by ChEMBL
LigandPNGBDBM50258766(CHEMBL4077975)
Affinity DataIC50:  27nM. Assay description: Allosteric modulation of CB1 receptor (unknown origin) assessed as inhibition of calcium mobilization by FLIPR assay
In DepthDetails ArticlePubMed
TargetCannabinoid receptor 1(Homo sapiens (Human))
Usona Institute
Curated by ChEMBL
LigandPNGBDBM50258766(CHEMBL4077975)
Affinity DataIC50:  27nM. Assay description: Allosteric modulation of human CB1 receptor expressed in CHO cells co-expressing Galpha16 assessed as inhibition of CP55,940-induced calcium mobiliza...
In DepthDetails ArticlePubMed