BDBM50258788 (S)-2-amino-N-(3-(5-(5-(3-methoxyphenyl)-1,3,4-oxadiazol-2-yl)-3-(trifluoromethyl)-1H-pyrazol-1-yl)benzyl)propanamide::CHEMBL468721
SMILES COc1cccc(c1)-c1nnc(o1)-c1cc(nn1-c1cccc(CNC(=O)[C@H](C)N)c1)C(F)(F)F
InChI Key InChIKey=WPRIRISKDLZIEU-ZDUSSCGKSA-N
Data  1 IC50
  Tab Delimited (TSV)   2D SDfile   Computed 3D by Vconf -m prep SDfile
Find this compound or compounds like it in BindingDB:
Activity Spreadsheet -- Enzyme Inhibition Constant Data from BindingDB
Found 1 hit for monomerid = 50258788
TargetHistone-arginine methyltransferase CARM1(Homo sapiens (Human))
Bristol-Myers Squibb Pharmaceutical Research And Development
Curated by ChEMBL
LigandPNGBDBM50258788((S)-2-amino-N-(3-(5-(5-(3-methoxyphenyl)-1,3,4-oxa...)
Affinity DataIC50:  160nM. Assay description: Inhibition of CARM1 assessed as blockade of histone H3 methylation
In DepthDetails ArticlePubMed