BDBM50259227 (R,S/S,R)-syn-1-(methyl(phenyl)amino)-3-(methylamino)-1-phenylpropan-2-ol::CHEMBL504971
SMILES CNC[C@@H](O)[C@@H](N(C)c1ccccc1)c1ccccc1
InChI Key InChIKey=KWAYIPPRBHZSBU-SJORKVTESA-N
Data  2 IC50
  Tab Delimited (TSV)   2D SDfile   Computed 3D by Vconf -m prep SDfile
Find this compound or compounds like it in BindingDB:
Activity Spreadsheet -- Enzyme Inhibition Constant Data from BindingDB
Found 2 hits for monomerid = 50259227
TargetSodium-dependent serotonin transporter(Homo sapiens (Human))
Wyeth Research
Curated by ChEMBL
LigandPNGBDBM50259227((R,S/S,R)-syn-1-(methyl(phenyl)amino)-3-(methylami...)
Affinity DataIC50:  76nM. Assay description: Inhibition of serotonin uptake at human SERT expressed in human JAR cells
In DepthDetails ArticlePubMed
TargetSodium-dependent noradrenaline transporter(Homo sapiens (Human))
Wyeth Research
Curated by ChEMBL
LigandPNGBDBM50259227((R,S/S,R)-syn-1-(methyl(phenyl)amino)-3-(methylami...)
Affinity DataIC50:  30nM. Assay description: Inhibition of norepinephrine uptake at human NET expressed in MDCK-Net6 cells
In DepthDetails ArticlePubMed