BDBM50259262 (S)-N-(3-(3,4-dichlorobenzyl)-4-oxo-3,4-dihydroquinazolin-6-yl)-2-hydroxypropanamide::CHEMBL466891
SMILES C[C@H](O)C(=O)Nc1ccc2ncn(Cc3ccc(Cl)c(Cl)c3)c(=O)c2c1
InChI Key InChIKey=DGZBCKSHKIBZKD-JTQLQIEISA-N
Data  1 IC50
  Tab Delimited (TSV)   2D SDfile   Computed 3D by Vconf -m prep SDfile
Find this compound or compounds like it in BindingDB:
Activity Spreadsheet -- Enzyme Inhibition Constant Data from BindingDB
Found 1 hit for monomerid = 50259262
TargetAcyl-CoA desaturase 1(Rattus norvegicus (Rat))
Cv Therapeutics
Curated by ChEMBL
LigandPNGBDBM50259262((S)-N-(3-(3,4-dichlorobenzyl)-4-oxo-3,4-dihydroqui...)
Affinity DataIC50: >3.00E+4nM. Assay description: Inhibition of rat microsomal delta(9)-desaturase
In DepthDetails ArticlePubMed