BDBM50259433 (1R,5S)-3-Acetyl-7-{4-[3-(2-methoxy-benzyloxy)-propoxy]-phenyl}-3,9-diaza-bicyclo[3.3.1]non-6-ene-6-carboxylic acid cyclopropyl-(3-methoxy-2-methyl-benzyl)-amide::CHEMBL447097
SMILES [H][C@@]12CN(C[C@@]([H])(N1)C(C(=O)N(Cc1cccc(OC)c1C)C1CC1)=C(C2)c1ccc(OCCCOCc2ccccc2OC)cc1)C(C)=O
InChI Key InChIKey=IPORYFWZTGTXGH-CYEXUTLASA-N
Data  2 IC50
  Tab Delimited (TSV)   2D SDfile   Computed 3D by Vconf -m prep SDfile
Find this compound or compounds like it in BindingDB:
Activity Spreadsheet -- Enzyme Inhibition Constant Data from BindingDB
Found 2 hits for monomerid = 50259433
TargetRenin(Homo sapiens (Human))
Actelion Pharmaceuticals
Curated by ChEMBL
LigandPNGBDBM50259433((1R,5S)-3-Acetyl-7-{4-[3-(2-methoxy-benzyloxy)-pro...)
Affinity DataIC50:  0.620nM. Assay description: Inhibition of human recombinant rennin in buffer assessed as accumulation of angiotensin 1 using human tetradecapeptide by immunoassay
In DepthDetails ArticlePubMed
TargetRenin(Homo sapiens (Human))
Actelion Pharmaceuticals
Curated by ChEMBL
LigandPNGBDBM50259433((1R,5S)-3-Acetyl-7-{4-[3-(2-methoxy-benzyloxy)-pro...)
Affinity DataIC50:  29nM. Assay description: Inhibition of human recombinant rennin in human plasma assessed as accumulation of angiotensin 1 using human tetradecapeptide by immunoassay
In DepthDetails ArticlePubMed