BDBM50259454 (1R,5S)-3-Acetyl-7-{4-[2-(2,3,6-trifluoro-phenoxy)-ethoxy]-phenyl}-3,9-diaza-bicyclo[3.3.1]non-6-ene-6-carboxylic acid cyclopropyl-(2,3-dichloro-benzyl)-amide::CHEMBL475671
SMILES CC(=O)N1C[C@H]2CC(=C([C@@H](C1)N2)C(=O)N(Cc1cccc(Cl)c1Cl)C1CC1)c1ccc(OCCOc2c(F)ccc(F)c2F)cc1
InChI Key InChIKey=IDXLHUPKARTEIR-KPURRNSFSA-N
Data  2 IC50
  Tab Delimited (TSV)   2D SDfile   Computed 3D by Vconf -m prep SDfile
Find this compound or compounds like it in BindingDB:
Activity Spreadsheet -- Enzyme Inhibition Constant Data from BindingDB
Found 2 hits for monomerid = 50259454
TargetRenin(Homo sapiens (Human))
Actelion Pharmaceuticals
Curated by ChEMBL
LigandPNGBDBM50259454((1R,5S)-3-Acetyl-7-{4-[2-(2,3,6-trifluoro-phenoxy)...)
Affinity DataIC50:  0.790nM. Assay description: Inhibition of human recombinant rennin in buffer assessed as accumulation of angiotensin 1 using human tetradecapeptide by immunoassay
In DepthDetails ArticlePubMed
TargetRenin(Homo sapiens (Human))
Actelion Pharmaceuticals
Curated by ChEMBL
LigandPNGBDBM50259454((1R,5S)-3-Acetyl-7-{4-[2-(2,3,6-trifluoro-phenoxy)...)
Affinity DataIC50:  54nM. Assay description: Inhibition of human recombinant rennin in human plasma assessed as accumulation of angiotensin 1 using human tetradecapeptide by immunoassay
In DepthDetails ArticlePubMed