BDBM50260072 1-(3-methylbutyryl)-phloroglucinol-glucopyranoside::2-beta-D-glucopyranosyloxy-4,6-dihydroxyisovalerophenone::CHEMBL484029
SMILES CC(C)CC(=O)c1c(O)cc(O)cc1O[C@@H]1O[C@H](CO)[C@@H](O)[C@H](O)[C@H]1O
InChI Key InChIKey=SYVLRDXITUYNAK-USACIQFYSA-N
Data  1 IC50
  Tab Delimited (TSV)   2D SDfile   Computed 3D by Vconf -m prep SDfile
Find this compound or compounds like it in BindingDB:
Activity Spreadsheet -- Enzyme Inhibition Constant Data from BindingDB
Found 1 hit for monomerid = 50260072
TargetCytochrome P450 3A4(Homo sapiens (Human))
Kanazawa University
Curated by ChEMBL
LigandPNGBDBM50260072(1-(3-methylbutyryl)-phloroglucinol-glucopyranoside...)
Affinity DataIC50:  1.20E+5nM. Assay description: Inhibition of human CYP3A4
In DepthDetails ArticlePubMed