BDBM50260284 CHEMBL494383::saurufuran B
SMILES C\C(CC\C=C(/C)C(O)=O)=C/CC\C(C)=C\Cc1occc1C
InChI Key InChIKey=BMGJSWCTAGIXJL-NIAATNHFSA-N
Data  1 EC50
  Tab Delimited (TSV)   2D SDfile   Computed 3D by Vconf -m prep SDfile
Find this compound or compounds like it in BindingDB:
Activity Spreadsheet -- Enzyme Inhibition Constant Data from BindingDB
Found 1 hit for monomerid = 50260284
TargetPeroxisome proliferator-activated receptor gamma(Homo sapiens (Human))
Korea Research Institute Of Bioscience And Biotechnology
Curated by ChEMBL
LigandPNGBDBM50260284(CHEMBL494383 | saurufuran B)
Affinity DataEC50: >1.00E+5nM. Assay description: Agonist activity at human PPARgamma expressed in mouse NIH/3T3 cells assessed as receptor activation after 16 hrs by luciferase based reporter gene a...
In DepthDetails ArticlePubMed