BDBM50261135 CHEMBL525938::LMNNAEHINQFYMFI
SMILES CC[C@H](C)[C@H](NC(=O)[C@H](Cc1ccccc1)NC(=O)[C@H](CCSC)NC(=O)[C@H](Cc1ccc(O)cc1)NC(=O)[C@H](Cc1ccccc1)NC(=O)[C@H](CCC(N)=O)NC(=O)[C@H](CC(N)=O)NC(=O)[C@@H](NC(=O)[C@H](Cc1cnc[nH]1)NC(=O)[C@H](CCC(O)=O)NC(=O)[C@H](C)NC(=O)[C@H](CC(N)=O)NC(=O)[C@H](CC(N)=O)NC(=O)[C@H](CCSC)NC(=O)[C@@H](N)CC(C)C)[C@@H](C)CC)C(O)=O
InChI Key InChIKey=BKUMDIBEMMXUBJ-SNQGWSHJSA-N
Data  1 KI
  Tab Delimited (TSV)   2D SDfile   Computed 3D by Vconf -m prep SDfile
Find this compound or compounds like it in BindingDB:
Activity Spreadsheet -- Enzyme Inhibition Constant Data from BindingDB
Found 1 hit for monomerid = 50261135
TargetFalcipain 2(Plasmodium falciparum)
International Center For Genetic Engineering And Biotechnology
Curated by ChEMBL
LigandPNGBDBM50261135(CHEMBL525938 | LMNNAEHINQFYMFI)
Affinity DataKi:  3.80E+3nM. Assay description: Inhibition of Plasmodium falciparum recombinant falcipain-2
In DepthDetails ArticlePubMed