BDBM50263222 2'-Ethoxy-5'-methoxy-2-(5-methylthienyl)chalcone::CHEMBL476787
SMILES CCOc1ccc(OC)cc1C(=O)\C=C\c1ccc(C)s1
InChI Key InChIKey=MQOPWZWAQKTNRT-CMDGGOBGSA-N
Data  1 IC50
  Tab Delimited (TSV)   2D SDfile   Computed 3D by Vconf -m prep SDfile
Find this compound or compounds like it in BindingDB:
Activity Spreadsheet -- Enzyme Inhibition Constant Data from BindingDB
Found 1 hit for monomerid = 50263222
TargetXanthine dehydrogenase/oxidase(Homo sapiens (Human))
Kaohsiung Medical University
Curated by ChEMBL
LigandPNGBDBM50263222(2'-Ethoxy-5'-methoxy-2-(5-methylthienyl)chalcone |...)
Affinity DataIC50:  1.31E+5nM. Assay description: Inhibition of xanthine oxidase (unknown origin)
In DepthDetails ArticlePubMed