BDBM50264931 CHEMBL4084457
SMILES CC(C)C[C@H](NC(C)=O)C(=O)N[C@@H](CC(C)C)C(=O)N[C@@H](CC(C)C)C(=O)N[C@@H](Cc1cnc[nH]1)C(=O)N[C@@H](CCCNC(N)=N)C(=O)N[C@@H](C(C)C)C(=O)N[C@@H](CCCCN)C(=O)NCc1ccc(cc1)C(N)=N
InChI Key InChIKey=NCEKQFRJVMDWID-FVMQRRFMSA-N
Data  2 KI
  Tab Delimited (TSV)   2D SDfile   Computed 3D by Vconf -m prep SDfile
Find this compound or compounds like it in BindingDB:
Activity Spreadsheet -- Enzyme Inhibition Constant Data from BindingDB
Found 2 hits for monomerid = 50264931
TargetProprotein convertase subtilisin/kexin type 6(Homo sapiens (Human))
University Of Gdansk
Curated by ChEMBL
LigandPNGBDBM50264931(CHEMBL4084457)
Affinity DataKi:  0.400nM. Assay description: Inhibition of recombinant human PACE4 expressed in drosophila S2 cells using pyrGlu-Arg-Thr-Lys-Arg-7-amido-4-methylcoumarin as substrate after 60 mi...
In DepthDetails ArticlePubMed
TargetFurin(Homo sapiens (Human))
University Of Gdansk
Curated by ChEMBL
LigandPNGBDBM50264931(CHEMBL4084457)
Affinity DataKi:  0.900nM. Assay description: Inhibition of recombinant human furin expressed in drosophila S2 cells using pyrGlu-Arg-Thr-Lys-Arg-7-amido-4-methylcoumarin as substrate after 60 mi...
In DepthDetails ArticlePubMed