BDBM50265294 CHEMBL496938::N,N-Dimethyl-2-[2-(N-4-nitrobenzylamine)-4-tolylthio]benzylamine
SMILES CN(C)Cc1ccccc1Sc1ccc(C)cc1NCc1ccc(cc1)[N+]([O-])=O
InChI Key InChIKey=BYTXKMDEYAZNON-UHFFFAOYSA-N
Data  3 KI
  Tab Delimited (TSV)   2D SDfile   Computed 3D by Vconf -m prep SDfile
Find this compound or compounds like it in BindingDB:
Activity Spreadsheet -- Enzyme Inhibition Constant Data from BindingDB
Found 3 hits for monomerid = 50265294
TargetSodium-dependent serotonin transporter(Rattus norvegicus (rat))
University Of Tours
Curated by ChEMBL
LigandPNGBDBM50265294(CHEMBL496938 | N,N-Dimethyl-2-[2-(N-4-nitrobenzyla...)
Affinity DataKi:  60nM. Assay description: Displacement of [3H]MADAM from SERT in rat brain cortex membrane
In DepthDetails ArticlePubMed
TargetSodium-dependent dopamine transporter(Homo sapiens (Human))
University Of Tours
Curated by ChEMBL
LigandPNGBDBM50265294(CHEMBL496938 | N,N-Dimethyl-2-[2-(N-4-nitrobenzyla...)
Affinity DataKi: >1.00E+3nM. Assay description: Displacement of [3H]GBR12935 from human cloned DAT expressed in HEK293 cells
In DepthDetails ArticlePubMed
TargetSodium-dependent noradrenaline transporter(Homo sapiens (Human))
University Of Tours
Curated by ChEMBL
LigandPNGBDBM50265294(CHEMBL496938 | N,N-Dimethyl-2-[2-(N-4-nitrobenzyla...)
Affinity DataKi: >1.90E+3nM. Assay description: Displacement of [3H]nisoxetine from human cloned NET expressed in HEK293 cells
In DepthDetails ArticlePubMed