BDBM50265433 1-Isobutyl-4-phenylpiperidine-4-carbonitrile::CHEMBL486190
SMILES CC(C)CN1CCC(CC1)(C#N)c1ccccc1
InChI Key InChIKey=BFMDDWDARNVCJG-UHFFFAOYSA-N
Data  1 KI
  Tab Delimited (TSV)   2D SDfile   Computed 3D by Vconf -m prep SDfile
Find this compound or compounds like it in BindingDB:
Activity Spreadsheet -- Enzyme Inhibition Constant Data from BindingDB
Found 1 hit for monomerid = 50265433
TargetSigma non-opioid intracellular receptor 1(RAT)
University Of Maryland
Curated by ChEMBL
LigandPNGBDBM50265433(1-Isobutyl-4-phenylpiperidine-4-carbonitrile | CHE...)
Affinity DataKi:  0.350nM. Assay description: Displacement of [3H](+)-pentazocine from sigma 1 opioid receptor in rat brain cerebellum
In DepthDetails ArticlePubMed