BDBM50265827 6-(4-(1-(dimethylamino)cyclopropyl)phenyl)-1-(4-methoxyphenyl)-7-oxo-4,5,6,7-tetrahydro-1H-pyrazolo[3,4-c]pyridine-3-carbonitrile::CHEMBL461453
SMILES COc1ccc(cc1)-n1nc(C#N)c2CCN(C(=O)c12)c1ccc(cc1)C1(CC1)N(C)C
InChI Key InChIKey=HWBSEYIBGSCHEJ-UHFFFAOYSA-N
Data  1 KI
  Tab Delimited (TSV)   2D SDfile   Computed 3D by Vconf -m prep SDfile
Find this compound or compounds like it in BindingDB:
Activity Spreadsheet -- Enzyme Inhibition Constant Data from BindingDB
Found 1 hit for monomerid = 50265827
TargetCoagulation factor X(Homo sapiens (Human))
Bristol-Myers Squibb
Curated by ChEMBL
LigandPNGBDBM50265827(6-(4-(1-(dimethylamino)cyclopropyl)phenyl)-1-(4-me...)
Affinity DataKi:  0.0800nM. Assay description: Binding affinity to human coagulation factor 10a
In DepthDetails ArticlePubMed