BDBM50265897 CHEMBL4096579
SMILES COc1nn(-c2ccc(C)cc2)c2cc(cc(F)c12)-c1ccc(cc1)[C@H]1C[C@@H]1C(O)=O
InChI Key InChIKey=VAIBBLPRASEICM-UXHICEINSA-N
Data  3 EC50
  Tab Delimited (TSV)   2D SDfile   Computed 3D by Vconf -m prep SDfile
Find this compound or compounds like it in BindingDB:
Activity Spreadsheet -- Enzyme Inhibition Constant Data from BindingDB
Found 3 hits for monomerid = 50265897
TargetFree fatty acid receptor 4(Homo sapiens (Human))
Astrazeneca
Curated by ChEMBL
LigandPNGBDBM50265897(CHEMBL4096579)
Affinity DataEC50:  78nM. Assay description: Agonist activity at human GPR120 expressed in CHO-FlpIn cells after 15 mins by DMR assay
In DepthDetails ArticlePubMed
TargetFree fatty acid receptor 1(Mus musculus)
Astrazeneca
Curated by ChEMBL
LigandPNGBDBM50265897(CHEMBL4096579)
Affinity DataEC50: >1.00E+5nM. Assay description: Agonist activity at mouse GPR40 expressed in HEK293 cells assessed as increase in intracellular calcium level after 5 mins by FLUO-4-AM dye-based FLI...
In DepthDetails ArticlePubMed
TargetFree fatty acid receptor 4(Mus musculus)
Astrazeneca
Curated by ChEMBL
LigandPNGBDBM50265897(CHEMBL4096579)
Affinity DataEC50:  17nM. Assay description: Agonist activity at mouse GPR120 expressed in CHO-FlpIn cells after 15 mins by DMR assay
In DepthDetails ArticlePubMed