BDBM50265936 CHEMBL4068705
SMILES Cc1cccc(CN2CCc3[nH]c(cc3C2=O)-c2ccnc(NC3CCOCC3)n2)n1
InChI Key InChIKey=IYYIFHJQDSMTKS-UHFFFAOYSA-N
Data  5 IC50
  Tab Delimited (TSV)   2D SDfile   Computed 3D by Vconf -m prep SDfile
Find this compound or compounds like it in BindingDB:
Activity Spreadsheet -- Enzyme Inhibition Constant Data from BindingDB
Found 5 hits for monomerid = 50265936
TargetMitogen-activated protein kinase 1(Homo sapiens (Human))
Astrazeneca
Curated by ChEMBL
LigandPNGBDBM50265936(CHEMBL4068705)
Affinity DataIC50:  0.470nM. Assay description: Inhibition of ERK2 (unknown origin) in the presence of 60 uM ATP
In DepthDetails ArticlePubMed
TargetMitogen-activated protein kinase 1(Homo sapiens (Human))
Astrazeneca
Curated by ChEMBL
LigandPNGBDBM50265936(CHEMBL4068705)
Affinity DataIC50:  9.40E+3nM. Assay description: Inhibition of ERK2 in human A375 cells harboring BRAF V600E mutant assessed as decrease in phosphorylated ERK2 levels
In DepthDetails ArticlePubMed
TargetDual specificity mitogen-activated protein kinase kinase 1(Homo sapiens (Human))
Astrazeneca
Curated by ChEMBL
LigandPNGBDBM50265936(CHEMBL4068705)
Affinity DataIC50: >1.00E+4nM. Assay description: Inhibition of MEK1 (unknown origin)
In DepthDetails ArticlePubMed
TargetMitogen-activated protein kinase 1(Homo sapiens (Human))
Astrazeneca
Curated by ChEMBL
LigandPNGBDBM50265936(CHEMBL4068705)
Affinity DataIC50:  370nM. Assay description: Inhibition of ERK2 in human A375 cells harboring BRAF V600E mutant assessed as decrease in phosphorylated RSK levels
In DepthDetails ArticlePubMed
TargetMitogen-activated protein kinase 1(Homo sapiens (Human))
Astrazeneca
Curated by ChEMBL
LigandPNGBDBM50265936(CHEMBL4068705)
Affinity DataIC50:  1nM. Assay description: Inhibition of ERK2 (unknown origin) in the presence of 1 mM ATP
In DepthDetails ArticlePubMed