BDBM50265945 1-(4-methoxyphenyl)-6-(4-(1-(methylsulfonylmethyl)cyclopropyl)phenyl)-7-oxo-4,5,6,7-tetrahydro-1H-pyrazolo[3,4-c]pyridine-3-carbonitrile::CHEMBL512287
SMILES COc1ccc(cc1)-n1nc(C#N)c2CCN(C(=O)c12)c1ccc(cc1)C1(CS(C)(=O)=O)CC1
InChI Key InChIKey=MUCLFTMUJXNJRX-UHFFFAOYSA-N
Data  1 KI
  Tab Delimited (TSV)   2D SDfile   Computed 3D by Vconf -m prep SDfile
Find this compound or compounds like it in BindingDB:
Activity Spreadsheet -- Enzyme Inhibition Constant Data from BindingDB
Found 1 hit for monomerid = 50265945
TargetCoagulation factor X(Homo sapiens (Human))
Bristol-Myers Squibb
Curated by ChEMBL
LigandPNGBDBM50265945(1-(4-methoxyphenyl)-6-(4-(1-(methylsulfonylmethyl)...)
Affinity DataKi:  0.290nM. Assay description: Binding affinity to human coagulation factor 10a
In DepthDetails ArticlePubMed