BDBM50265963 CHEMBL4083098
SMILES CC1Cn2cc(cc2C(=O)N1Cc1cccc(C)n1)-c1ccnc(Nc2ccnn2C)n1
InChI Key InChIKey=NKHSCFWQFSFQBX-UHFFFAOYSA-N
Data  10 IC50
  Tab Delimited (TSV)   2D SDfile   Computed 3D by Vconf -m prep SDfile
Find this compound or compounds like it in BindingDB:
Activity Spreadsheet -- Enzyme Inhibition Constant Data from BindingDB
Found 10 hits for monomerid = 50265963
TargetMitogen-activated protein kinase 1(Homo sapiens (Human))
Astrazeneca
Curated by ChEMBL
LigandPNGBDBM50265963(CHEMBL4083098)
Affinity DataIC50: <0.390nM. Assay description: Inhibition of ERK2 (unknown origin) in the presence of 60 uM ATP
In DepthDetails ArticlePubMed
TargetDual specificity mitogen-activated protein kinase kinase 1(Homo sapiens (Human))
Astrazeneca
Curated by ChEMBL
LigandPNGBDBM50265963(CHEMBL4083098)
Affinity DataIC50: >1.00E+4nM. Assay description: Inhibition of MEK1 (unknown origin)
In DepthDetails ArticlePubMed
TargetMitogen-activated protein kinase 1(Homo sapiens (Human))
Astrazeneca
Curated by ChEMBL
LigandPNGBDBM50265963(CHEMBL4083098)
Affinity DataIC50:  16nM. Assay description: Inhibition of ERK2 (unknown origin) in the presence of 1 mM ATP
In DepthDetails ArticlePubMed
TargetMitogen-activated protein kinase 1(Homo sapiens (Human))
Astrazeneca
Curated by ChEMBL
LigandPNGBDBM50265963(CHEMBL4083098)
Affinity DataIC50:  16nM. Assay description: Inhibition of ERK2 (unknown origin) in the presence of 1 mM ATP
In DepthDetails ArticlePubMed
TargetDual specificity mitogen-activated protein kinase kinase 1(Homo sapiens (Human))
Astrazeneca
Curated by ChEMBL
LigandPNGBDBM50265963(CHEMBL4083098)
Affinity DataIC50: >1.00E+4nM. Assay description: Inhibition of MEK1 (unknown origin)
In DepthDetails ArticlePubMed
TargetMitogen-activated protein kinase 1(Homo sapiens (Human))
Astrazeneca
Curated by ChEMBL
LigandPNGBDBM50265963(CHEMBL4083098)
Affinity DataIC50:  730nM. Assay description: Inhibition of ERK2 in human A375 cells harboring BRAF V600E mutant assessed as decrease in phosphorylated RSK levels
In DepthDetails ArticlePubMed
TargetMitogen-activated protein kinase 1(Homo sapiens (Human))
Astrazeneca
Curated by ChEMBL
LigandPNGBDBM50265963(CHEMBL4083098)
Affinity DataIC50: >3.00E+4nM. Assay description: Inhibition of ERK2 in human A375 cells harboring BRAF V600E mutant assessed as decrease in phosphorylated ERK2 levels
In DepthDetails ArticlePubMed
TargetMitogen-activated protein kinase 1(Homo sapiens (Human))
Astrazeneca
Curated by ChEMBL
LigandPNGBDBM50265963(CHEMBL4083098)
Affinity DataIC50:  2.90nM. Assay description: Inhibition of ERK2 (unknown origin) in the presence of 60 uM ATP
In DepthDetails ArticlePubMed
TargetMitogen-activated protein kinase 1(Homo sapiens (Human))
Astrazeneca
Curated by ChEMBL
LigandPNGBDBM50265963(CHEMBL4083098)
Affinity DataIC50:  2.20E+4nM. Assay description: Inhibition of ERK2 in human A375 cells harboring BRAF V600E mutant assessed as decrease in phosphorylated ERK2 levels
In DepthDetails ArticlePubMed
TargetMitogen-activated protein kinase 1(Homo sapiens (Human))
Astrazeneca
Curated by ChEMBL
LigandPNGBDBM50265963(CHEMBL4083098)
Affinity DataIC50:  730nM. Assay description: Inhibition of ERK2 in human A375 cells harboring BRAF V600E mutant assessed as decrease in phosphorylated RSK levels
In DepthDetails ArticlePubMed