BDBM50265970 CHEMBL4097186
SMILES O=C1N(Cc2ccccc2)CCc2[nH]c(cc12)-c1ccnc(NC2CCOCC2)n1
InChI Key InChIKey=KERNFUCXORNNFU-UHFFFAOYSA-N
Data  5 IC50
PDB links: 1 PDB ID matches this monomer.
  Tab Delimited (TSV)   2D SDfile   Computed 3D by Vconf -m prep SDfile
Find this compound or compounds like it in BindingDB:
Activity Spreadsheet -- Enzyme Inhibition Constant Data from BindingDB
Found 5 hits for monomerid = 50265970
TargetDual specificity mitogen-activated protein kinase kinase 1(Homo sapiens (Human))
Astrazeneca
Curated by ChEMBL
LigandPNGBDBM50265970(CHEMBL4097186)
Affinity DataIC50: >1.00E+4nM. Assay description: Inhibition of MEK1 (unknown origin)
In DepthDetails ArticlePubMed
TargetMitogen-activated protein kinase 1(Homo sapiens (Human))
Astrazeneca
Curated by ChEMBL
LigandPNGBDBM50265970(CHEMBL4097186)
Affinity DataIC50:  220nM. Assay description: Inhibition of ERK2 in human A375 cells harboring BRAF V600E mutant assessed as decrease in phosphorylated ERK2 levels
TargetMitogen-activated protein kinase 1(Homo sapiens (Human))
Astrazeneca
Curated by ChEMBL
LigandPNGBDBM50265970(CHEMBL4097186)
Affinity DataIC50: <0.320nM. Assay description: Inhibition of ERK2 (unknown origin) in the presence of 60 uM ATP
TargetMitogen-activated protein kinase 1(Homo sapiens (Human))
Astrazeneca
Curated by ChEMBL
LigandPNGBDBM50265970(CHEMBL4097186)
Affinity DataIC50:  80nM. Assay description: Inhibition of ERK2 in human A375 cells harboring BRAF V600E mutant assessed as decrease in phosphorylated RSK levels
TargetMitogen-activated protein kinase 1(Homo sapiens (Human))
Astrazeneca
Curated by ChEMBL
LigandPNGBDBM50265970(CHEMBL4097186)
Affinity DataIC50: <0.300nM. Assay description: Inhibition of ERK2 (unknown origin) in the presence of 1 mM ATP