BDBM50266048 1-(4-methoxyphenyl)-3-(methylsulfonyl)-6-(4-(1-(morpholinomethyl)cyclopropyl)phenyl)-5,6-dihydro-1H-pyrazolo[3,4-c]pyridin-7(4H)-one 2,2,2-trifluoroacetate::CHEMBL504703
SMILES COc1ccc(cc1)-n1nc(c2CCN(C(=O)c12)c1ccc(cc1)C1(CN2CCOCC2)CC1)S(C)(=O)=O
InChI Key InChIKey=XAZLNIYIFUKCHU-UHFFFAOYSA-N
Data  1 KI
  Tab Delimited (TSV)   2D SDfile   Computed 3D by Vconf -m prep SDfile
Find this compound or compounds like it in BindingDB:
Activity Spreadsheet -- Enzyme Inhibition Constant Data from BindingDB
Found 1 hit for monomerid = 50266048
TargetCoagulation factor X(Homo sapiens (Human))
Bristol-Myers Squibb
Curated by ChEMBL
LigandPNGBDBM50266048(1-(4-methoxyphenyl)-3-(methylsulfonyl)-6-(4-(1-(mo...)
Affinity DataKi:  0.0800nM. Assay description: Binding affinity to human coagulation factor 10a
In DepthDetails ArticlePubMed