BDBM50266082 1-(4-methoxyphenyl)-7-oxo-6-(4-(1-((2-oxopyrrolidin-1-yl)methyl)cyclopropyl)phenyl)-4,5,6,7-tetrahydro-1H-pyrazolo[3,4-c]pyridine-3-carboxamide 2,2,2-trifluoroacetate::CHEMBL510030
SMILES COc1ccc(cc1)-n1nc(C(N)=O)c2CCN(C(=O)c12)c1ccc(cc1)C1(CN2CCCC2=O)CC1
InChI Key InChIKey=YKWXBMHCOOWDIS-UHFFFAOYSA-N
Data  1 KI
  Tab Delimited (TSV)   2D SDfile   Computed 3D by Vconf -m prep SDfile
Find this compound or compounds like it in BindingDB:
Activity Spreadsheet -- Enzyme Inhibition Constant Data from BindingDB
Found 1 hit for monomerid = 50266082
TargetCoagulation factor X(Homo sapiens (Human))
Bristol-Myers Squibb
Curated by ChEMBL
LigandPNGBDBM50266082(1-(4-methoxyphenyl)-7-oxo-6-(4-(1-((2-oxopyrrolidi...)
Affinity DataKi:  0.110nM. Assay description: Binding affinity to human coagulation factor 10a
In DepthDetails ArticlePubMed