BDBM50266382 CHEMBL457579::N-[2-(3,5-Dimethylpyrazol-1-yl)-6-morpholin-4-ylpyrimidin-4-yl]acetamide
SMILES CC(=O)Nc1cc(nc(n1)-n1nc(C)cc1C)N1CCOCC1
InChI Key InChIKey=UTOGKCKVWJBVAS-UHFFFAOYSA-N
Data  2 KI
  Tab Delimited (TSV)   2D SDfile   Computed 3D by Vconf -m prep SDfile
Find this compound or compounds like it in BindingDB:
Activity Spreadsheet -- Enzyme Inhibition Constant Data from BindingDB
Found 2 hits for monomerid = 50266382
TargetAdenosine receptor A2a(Homo sapiens (Human))
Neurocrine Biosciences
Curated by ChEMBL
LigandPNGBDBM50266382(CHEMBL457579 | N-[2-(3,5-Dimethylpyrazol-1-yl)-6-m...)
Affinity DataKi:  313nM. Assay description: Displacement of [3H]ZM241385 from human adenosine A2A receptor expressed in HEK293 cells
In DepthDetails ArticlePubMed
TargetAdenosine receptor A1(Homo sapiens (Human))
Neurocrine Biosciences
Curated by ChEMBL
LigandPNGBDBM50266382(CHEMBL457579 | N-[2-(3,5-Dimethylpyrazol-1-yl)-6-m...)
Affinity DataKi:  8.12E+3nM. Assay description: Displacement of [3H]DPCPX from human adenosine A1 receptor expressed in HEK293 cells
In DepthDetails ArticlePubMed