BDBM50266474 CHEMBL455848::N-[2-(3,5-Dimethylpyrazol-1-yl)-6-((S)-4-methoxy-(R)-2-methoxymethylpyrrolidin-1-yl)pyrimidin-4-yl]acetamide
SMILES COC[C@H]1C[C@@H](CN1c1cc(NC(C)=O)nc(n1)-n1nc(C)cc1C)OC
InChI Key InChIKey=FCRJTICZALDLSZ-CABCVRRESA-N
Data  2 KI
  Tab Delimited (TSV)   2D SDfile   Computed 3D by Vconf -m prep SDfile
Find this compound or compounds like it in BindingDB:
Activity Spreadsheet -- Enzyme Inhibition Constant Data from BindingDB
Found 2 hits for monomerid = 50266474
TargetAdenosine receptor A2a(Homo sapiens (Human))
Neurocrine Biosciences
Curated by ChEMBL
LigandPNGBDBM50266474(CHEMBL455848 | N-[2-(3,5-Dimethylpyrazol-1-yl)-6-(...)
Affinity DataKi:  7.5nM. Assay description: Displacement of [3H]ZM241385 from human adenosine A2A receptor expressed in HEK293 cells
In DepthDetails ArticlePubMed
TargetAdenosine receptor A1(Homo sapiens (Human))
Neurocrine Biosciences
Curated by ChEMBL
LigandPNGBDBM50266474(CHEMBL455848 | N-[2-(3,5-Dimethylpyrazol-1-yl)-6-(...)
Affinity DataKi:  352nM. Assay description: Displacement of [3H]DPCPX from human adenosine A1 receptor expressed in HEK293 cells
In DepthDetails ArticlePubMed