BDBM50268048 CHEMBL4098491
SMILES COc1ccc(cc1)C1C(C#N)=C(NC(=O)CN2CCN(CC2)c2ccccc2)Oc2c1c(=O)oc1ccccc21
InChI Key InChIKey=FNSAEVBFZGDWQS-UHFFFAOYSA-N
Data  1 KI  2 IC50
  Tab Delimited (TSV)   2D SDfile   Computed 3D by Vconf -m prep SDfile
Find this compound or compounds like it in BindingDB:
Activity Spreadsheet -- Enzyme Inhibition Constant Data from BindingDB
Found 3 hits for monomerid = 50268048
TargetAcetylcholinesterase(Electrophorus electricus (Electric eel))
Tehran University Of Medical Sciences
Curated by ChEMBL
LigandPNGBDBM50268048(CHEMBL4098491)
Affinity DataKi:  3.19E+3nM. Assay description: Mixed-type inhibition of electric eel AChE using varying levels of acetylthiocholine iodide as substrate measured for 2 mins by Lineweaver-Burk plot ...
In DepthDetails ArticlePubMed
TargetAcetylcholinesterase(Electrophorus electricus (Electric eel))
Tehran University Of Medical Sciences
Curated by ChEMBL
LigandPNGBDBM50268048(CHEMBL4098491)
Affinity DataIC50:  1.12E+3nM. Assay description: Inhibition of electric eel AChE using acetylthiocholine iodide as substrate measured for 6 mins by Ellman's method
In DepthDetails ArticlePubMed
TargetCholinesterase(Equus caballus (Horse))
Tehran University Of Medical Sciences
Curated by ChEMBL
LigandPNGBDBM50268048(CHEMBL4098491)
Affinity DataIC50:  4.57E+4nM. Assay description: Inhibition of equine serum BuChE using butyrylthiocholine iodide as substrate measured for 6 mins by Ellman's method
In DepthDetails ArticlePubMed