BDBM50268889 CHEMBL496624::N-(2-ethyl-6-methylbenzyl)-2,3-dimethyl-6-(1-methyl-1H-1,2,4-triazol-5-yl)imidazo[1,2-a]pyridin-8-amine
SMILES CCc1cccc(C)c1CNc1cc(cn2c(C)c(C)nc12)-c1ncnn1C
InChI Key InChIKey=IJGCNVPTZVEOMQ-UHFFFAOYSA-N
Data  3 IC50
  Tab Delimited (TSV)   2D SDfile   Computed 3D by Vconf -m prep SDfile
Find this compound or compounds like it in BindingDB:
Activity Spreadsheet -- Enzyme Inhibition Constant Data from BindingDB
Found 3 hits for monomerid = 50268889
TargetCytochrome P450 3A4(Homo sapiens (Human))
Glaxosmithkline
Curated by ChEMBL
LigandPNGBDBM50268889(CHEMBL496624 | N-(2-ethyl-6-methylbenzyl)-2,3-dime...)
Affinity DataIC50:  7.50E+3nM. Assay description: Inhibition of CYP3A4 (unknown origin) using diethoxyfluorescein as substrate
In DepthDetails ArticlePubMed
TargetCytochrome P450 3A4(Homo sapiens (Human))
Glaxosmithkline
Curated by ChEMBL
LigandPNGBDBM50268889(CHEMBL496624 | N-(2-ethyl-6-methylbenzyl)-2,3-dime...)
Affinity DataIC50:  1.30E+4nM. Assay description: Inhibition of CYP3A4 (unknown origin) using 7-benzyloxyquinoline as substrate
In DepthDetails ArticlePubMed
TargetCytochrome P450 2C9(Homo sapiens (Human))
Glaxosmithkline
Curated by ChEMBL
LigandPNGBDBM50268889(CHEMBL496624 | N-(2-ethyl-6-methylbenzyl)-2,3-dime...)
Affinity DataIC50:  3.20E+3nM. Assay description: Inhibition of CYP2C9 (unknown origin)
In DepthDetails ArticlePubMed