BDBM50269763 (+)-(5S,8S,10S)-20-methoxy-9,15-ene-puupehenol::CHEMBL456949
SMILES COc1cc2C=C3[C@H](CC[C@H]4C(C)(C)CCC[C@]34C)Oc2cc1O
InChI Key InChIKey=VKVKDSPLZVAEMG-NBHGPNQESA-N
Data  2 IC50
  Tab Delimited (TSV)   2D SDfile   Computed 3D by Vconf -m prep SDfile
Find this compound or compounds like it in BindingDB:
Activity Spreadsheet -- Enzyme Inhibition Constant Data from BindingDB
Found 2 hits for monomerid = 50269763
TargetPolyunsaturated fatty acid lipoxygenase ALOX12(Homo sapiens (Human))
University Of California Santa Cruz
Curated by ChEMBL
LigandPNGBDBM50269763((+)-(5S,8S,10S)-20-methoxy-9,15-ene-puupehenol | C...)
Affinity DataIC50:  780nM. Assay description: Inhibition of His-tagged human platelet 12-lipoxygenase
In DepthDetails ArticlePubMed
TargetPolyunsaturated fatty acid lipoxygenase ALOX15(Homo sapiens (Human))
University Of California Santa Cruz
Curated by ChEMBL
LigandPNGBDBM50269763((+)-(5S,8S,10S)-20-methoxy-9,15-ene-puupehenol | C...)
Affinity DataIC50:  1.00E+3nM. Assay description: Inhibition of His-tagged human reticulocyte 15-lipoxygenase
In DepthDetails ArticlePubMed