BDBM50270219 CHEMBL510847::GGGGGGTPQRARRRKKRW
SMILES C[C@@H](O)[C@H](NC(=O)CNC(=O)CNC(=O)CNC(=O)CNC(=O)CNC(=O)CN)C(=O)N1CCC[C@H]1C(=O)N[C@@H](CCC(N)=O)C(=O)N[C@@H](CCCN=C(N)N)C(=O)N[C@@H](C)C(=O)N[C@@H](CCCN=C(N)N)C(=O)N[C@@H](CCCN=C(N)N)C(=O)N[C@@H](CCCN=C(N)N)C(=O)N[C@@H](CCCCN)C(=O)N[C@@H](CCCCN)C(=O)N[C@@H](CCCN=C(N)N)C(=O)N[C@@H](Cc1c[nH]c2ccccc12)C(O)=O
InChI Key InChIKey=WHHDGKDCAGXVLB-WDAXHZIASA-N
Data  1 KI
  Tab Delimited (TSV)   2D SDfile   Computed 3D by Vconf -m prep SDfile
Find this compound or compounds like it in BindingDB:
Activity Spreadsheet -- Enzyme Inhibition Constant Data from BindingDB
Found 1 hit for monomerid = 50270219
TargetFurin(Homo sapiens (Human))
Institute For Medical Research
Curated by ChEMBL
LigandPNGBDBM50270219(CHEMBL510847 | GGGGGGTPQRARRRKKRW)
Affinity DataKi:  88nM. Assay description: Inhibition of human recombinant furin assessed as fluorescent Pyr-RTKR-AMC substrate cleavage
In DepthDetails ArticlePubMed