BDBM50272172 3-(3-(2-Chlorophenyl)-1,2,4-oxadiazol-5-yl)-N-(9-ethyl-9H-carbazol-3-yl)propanamide::CHEMBL499626
SMILES CCn1c2ccccc2c2cc(NC(=O)CCc3nc(no3)-c3ccccc3Cl)ccc12
InChI Key InChIKey=SHTUJXZMNFQBJY-UHFFFAOYSA-N
Data  2 EC50
  Tab Delimited (TSV)   2D SDfile   Computed 3D by Vconf -m prep SDfile
Find this compound or compounds like it in BindingDB:
Activity Spreadsheet -- Enzyme Inhibition Constant Data from BindingDB
Found 2 hits for monomerid = 50272172
TargetCannabinoid receptor 2(Homo sapiens (Human))
Amgen
Curated by ChEMBL
LigandPNGBDBM50272172(3-(3-(2-Chlorophenyl)-1,2,4-oxadiazol-5-yl)-N-(9-e...)
Affinity DataEC50:  6nM. Assay description: Agonist activity at human recombinant CB2 receptor expressed in Sf9 cells by GTP-europium binding assay
In DepthDetails ArticlePubMed
TargetCannabinoid receptor 1(Homo sapiens (Human))
Amgen
Curated by ChEMBL
LigandPNGBDBM50272172(3-(3-(2-Chlorophenyl)-1,2,4-oxadiazol-5-yl)-N-(9-e...)
Affinity DataEC50: >1.00E+4nM. Assay description: Agonist activity at human CB1 receptor expressed in Sf9 cells by GTP-europium binding assay
In DepthDetails ArticlePubMed