BDBM50272615 3-[((7S)-7-{[(2R)-2-(3-Chlorophenyl)-2-hydroxyethyl]amino}-5,6,7,8-tetrahydro-2-naphthalenyl)oxy]-5-(dimethylamino)benzoicAcid::CHEMBL497113
SMILES CN(C)c1cc(Oc2ccc3CC[C@@H](Cc3c2)NC[C@H](O)c2cccc(Cl)c2)cc(c1)C(O)=O
InChI Key InChIKey=KUTUYKMEQJYEPW-NVQXNPDNSA-N
Data  3 EC50
  Tab Delimited (TSV)   2D SDfile   Computed 3D by Vconf -m prep SDfile
Find this compound or compounds like it in BindingDB:
Activity Spreadsheet -- Enzyme Inhibition Constant Data from BindingDB
Found 3 hits for monomerid = 50272615
TargetBeta-2 adrenergic receptor(Homo sapiens (Human))
Astellas Pharma
Curated by ChEMBL
LigandPNGBDBM50272615(3-[((7S)-7-{[(2R)-2-(3-Chlorophenyl)-2-hydroxyethy...)
Affinity DataEC50: >1.00E+3nM. Assay description: Agonist activity at human beta2 adrenergic receptor expressed in CHO cells assessed as cAMP accumulation
In DepthDetails ArticlePubMed
TargetBeta-3 adrenergic receptor(Homo sapiens (Human))
Astellas Pharma
Curated by ChEMBL
LigandPNGBDBM50272615(3-[((7S)-7-{[(2R)-2-(3-Chlorophenyl)-2-hydroxyethy...)
Affinity DataEC50:  3.20nM. Assay description: Agonist activity at human cloned beta3 adrenergic receptor expressed in CHO cells assessed as cAMP accumulation
In DepthDetails ArticlePubMed
TargetBeta-1 adrenergic receptor(Homo sapiens (Human))
Astellas Pharma
Curated by ChEMBL
LigandPNGBDBM50272615(3-[((7S)-7-{[(2R)-2-(3-Chlorophenyl)-2-hydroxyethy...)
Affinity DataEC50: >1.00E+3nM. Assay description: Agonist activity at human cloned beta-1 adrenergic receptor expressed in CHO cells assessed as cAMP accumulation
In DepthDetails ArticlePubMed