BDBM50272636 4-ethyl-6-methoxy-2-(2-methoxy-4,6-dimethylphenyl)-N,N-dipropylpyrimidin-5-amine::CHEMBL524617
SMILES CCCN(CCC)c1c(CC)nc(nc1OC)-c1c(C)cc(C)cc1OC
InChI Key InChIKey=PBQNAQLFOBVUQO-UHFFFAOYSA-N
Data  1 KI
  Tab Delimited (TSV)   2D SDfile   Computed 3D by Vconf -m prep SDfile
Find this compound or compounds like it in BindingDB:
Activity Spreadsheet -- Enzyme Inhibition Constant Data from BindingDB
Found 1 hit for monomerid = 50272636
TargetCorticotropin-releasing factor receptor 1(Homo sapiens (Human))
Neurogen
Curated by ChEMBL
LigandPNGBDBM50272636(4-ethyl-6-methoxy-2-(2-methoxy-4,6-dimethylphenyl)...)
Affinity DataKi:  22nM. Assay description: Displacement of [125I]sauvagine from human CRF1 receptor expressed in IMR32 cells
In DepthDetails ArticlePubMed