BDBM50272640 4-methoxy-2-(2-methoxy-4,6-dimethylphenyl)-6-methyl-N-(pentan-3-yl)pyrimidin-5-amine::CHEMBL451660
SMILES CCC(CC)Nc1c(C)nc(nc1OC)-c1c(C)cc(C)cc1OC
InChI Key InChIKey=SDZSSUWZKPCITE-UHFFFAOYSA-N
Data  1 KI
  Tab Delimited (TSV)   2D SDfile   Computed 3D by Vconf -m prep SDfile
Find this compound or compounds like it in BindingDB:
Activity Spreadsheet -- Enzyme Inhibition Constant Data from BindingDB
Found 1 hit for monomerid = 50272640
TargetCorticotropin-releasing factor receptor 1(Homo sapiens (Human))
Neurogen
Curated by ChEMBL
LigandPNGBDBM50272640(4-methoxy-2-(2-methoxy-4,6-dimethylphenyl)-6-methy...)
Affinity DataKi:  94nM. Assay description: Displacement of [125I]sauvagine from human CRF1 receptor expressed in IMR32 cells
In DepthDetails ArticlePubMed