BDBM50272641 4-methoxy-2-(2-methoxy-4,6-dimethylphenyl)-6-methyl-N-neopentylpyrimidin-5-amine::CHEMBL497466
SMILES COc1cc(C)cc(C)c1-c1nc(C)c(NCC(C)(C)C)c(OC)n1
InChI Key InChIKey=ZGVNNHQVPVNBDQ-UHFFFAOYSA-N
Data  1 KI
  Tab Delimited (TSV)   2D SDfile   Computed 3D by Vconf -m prep SDfile
Find this compound or compounds like it in BindingDB:
Activity Spreadsheet -- Enzyme Inhibition Constant Data from BindingDB
Found 1 hit for monomerid = 50272641
TargetCorticotropin-releasing factor receptor 1(Homo sapiens (Human))
Neurogen
Curated by ChEMBL
LigandPNGBDBM50272641(4-methoxy-2-(2-methoxy-4,6-dimethylphenyl)-6-methy...)
Affinity DataKi: >1.00E+4nM. Assay description: Displacement of [125I]sauvagine from human CRF1 receptor expressed in IMR32 cells
In DepthDetails ArticlePubMed