BDBM50272697 2-(2,6-dimethoxyphenyl)-4-methoxy-6-methyl-N,N-dipropylpyrimidin-5-amine::CHEMBL510224
SMILES CCCN(CCC)c1c(C)nc(nc1OC)-c1c(OC)cccc1OC
InChI Key InChIKey=LKTBSSGEJIYZSC-UHFFFAOYSA-N
Data  1 KI
  Tab Delimited (TSV)   2D SDfile   Computed 3D by Vconf -m prep SDfile
Find this compound or compounds like it in BindingDB:
Activity Spreadsheet -- Enzyme Inhibition Constant Data from BindingDB
Found 1 hit for monomerid = 50272697
TargetCorticotropin-releasing factor receptor 1(Homo sapiens (Human))
Neurogen
Curated by ChEMBL
LigandPNGBDBM50272697(2-(2,6-dimethoxyphenyl)-4-methoxy-6-methyl-N,N-dip...)
Affinity DataKi:  277nM. Assay description: Displacement of [125I]sauvagine from human CRF1 receptor expressed in IMR32 cells
In DepthDetails ArticlePubMed