BDBM50272753 4-ethoxy-2-(2-methoxy-4,6-dimethylphenyl)-6-methyl-N,N-dipropylpyrimidin-5-amine::CHEMBL498318
SMILES CCCN(CCC)c1c(C)nc(nc1OCC)-c1c(C)cc(C)cc1OC
InChI Key InChIKey=GVNGJNWIMGHEQM-UHFFFAOYSA-N
Data  1 KI
  Tab Delimited (TSV)   2D SDfile   Computed 3D by Vconf -m prep SDfile
Find this compound or compounds like it in BindingDB:
Activity Spreadsheet -- Enzyme Inhibition Constant Data from BindingDB
Found 1 hit for monomerid = 50272753
TargetCorticotropin-releasing factor receptor 1(Homo sapiens (Human))
Neurogen
Curated by ChEMBL
LigandPNGBDBM50272753(4-ethoxy-2-(2-methoxy-4,6-dimethylphenyl)-6-methyl...)
Affinity DataKi:  16nM. Assay description: Displacement of [125I]sauvagine from human CRF1 receptor expressed in IMR32 cells
In DepthDetails ArticlePubMed