BDBM50273134 CHEMBL456803::N-[(3Z)-1-(1-Butyl)-2-oxo-1,2-dihydro-3H-indol-3-ylidene]benzohydrazide
SMILES CCCCN1C(=O)C(=NNC(=O)c2ccccc2)c2ccccc12
InChI Key InChIKey=UWHDLFQSPVEAQV-UHFFFAOYSA-N
Data  1 KI  1 EC50
  Tab Delimited (TSV)   2D SDfile   Computed 3D by Vconf -m prep SDfile
Find this compound or compounds like it in BindingDB:
Activity Spreadsheet -- Enzyme Inhibition Constant Data from BindingDB
Found 1 hit for monomerid = 50273134
TargetCannabinoid receptor 2(Homo sapiens (Human))
The University Of Texas M.D. Anderson Cancer Center
Curated by ChEMBL
LigandPNGBDBM50273134(CHEMBL456803 | N-[(3Z)-1-(1-Butyl)-2-oxo-1,2-dihyd...)
Affinity DataEC50:  40.1nM. Assay description: Agonist activity at human CB2 receptor expressed in CHO cells by [35S]GTPgammaS assay
In DepthDetails ArticlePubMed