BDBM50273566 CHEMBL461245::N-(1H-Indol-2-ylmethyl)-N-methyl-N-phenylamine
SMILES CN(Cc1cc2ccccc2[nH]1)c1ccccc1
InChI Key InChIKey=KHSLYBCUWUKVBX-UHFFFAOYSA-N
Data  3 KI
  Tab Delimited (TSV)   2D SDfile   Computed 3D by Vconf -m prep SDfile
Find this compound or compounds like it in BindingDB:
Activity Spreadsheet -- Enzyme Inhibition Constant Data from BindingDB
Found 3 hits for monomerid = 50273566
TargetAmine oxidase [flavin-containing] A(Bos taurus)
Sapienza University Of Rome
Curated by ChEMBL
LigandPNGBDBM50273566(CHEMBL461245 | N-(1H-Indol-2-ylmethyl)-N-methyl-N-...)
Affinity DataKi:  10nM. Assay description: Inhibition of bovine brain mitochondrial MAO-A by fluorometric assay
In DepthDetails ArticlePubMed
TargetAmine oxidase [flavin-containing] B(Bos taurus)
Sapienza University Of Rome
Curated by ChEMBL
LigandPNGBDBM50273566(CHEMBL461245 | N-(1H-Indol-2-ylmethyl)-N-methyl-N-...)
Affinity DataKi:  1.00E+3nM. Assay description: Inhibition of bovine brain mitochondrial MAO-B by fluorometric assay
In DepthDetails ArticlePubMed
TargetAmine oxidase [flavin-containing] A(Homo sapiens (Human))
Bharati Vidyapeeth Deemed University
Curated by ChEMBL
LigandPNGBDBM50273566(CHEMBL461245 | N-(1H-Indol-2-ylmethyl)-N-methyl-N-...)
Affinity DataKi:  1.00E+7nM. Assay description: Inhibition of MAO-A receptor
In DepthDetails ArticlePubMed