BDBM50273592 CHEMBL462054::N-Benzyl-N-(1H-indol-2-ylmethyl)-N-methylamine
SMILES CN(Cc1cc2ccccc2[nH]1)Cc1ccccc1
InChI Key InChIKey=YJDMPOSBUYNPGY-UHFFFAOYSA-N
Data  3 KI
  Tab Delimited (TSV)   2D SDfile   Computed 3D by Vconf -m prep SDfile
Find this compound or compounds like it in BindingDB:
Activity Spreadsheet -- Enzyme Inhibition Constant Data from BindingDB
Found 3 hits for monomerid = 50273592
TargetAmine oxidase [flavin-containing] A(Bos taurus)
Sapienza University Of Rome
Curated by ChEMBL
LigandPNGBDBM50273592(CHEMBL462054 | N-Benzyl-N-(1H-indol-2-ylmethyl)-N-...)
Affinity DataKi:  60nM. Assay description: Inhibition of bovine brain mitochondrial MAO-A by fluorometric assay
In DepthDetails ArticlePubMed
TargetAmine oxidase [flavin-containing] B(Bos taurus)
Sapienza University Of Rome
Curated by ChEMBL
LigandPNGBDBM50273592(CHEMBL462054 | N-Benzyl-N-(1H-indol-2-ylmethyl)-N-...)
Affinity DataKi:  700nM. Assay description: Inhibition of bovine brain mitochondrial MAO-B by fluorometric assay
In DepthDetails ArticlePubMed
TargetAmine oxidase [flavin-containing] A(Homo sapiens (Human))
Bharati Vidyapeeth Deemed University
Curated by ChEMBL
LigandPNGBDBM50273592(CHEMBL462054 | N-Benzyl-N-(1H-indol-2-ylmethyl)-N-...)
Affinity DataKi:  6.00E+7nM. Assay description: Inhibition of MAO-A receptor
In DepthDetails ArticlePubMed