BDBM50273718 CHEMBL457424::[2-(Purin-9-yl)ethyl]-bisphosphonic acid
SMILES OP(O)(=O)C(Cn1cnc2cncnc12)P(O)(O)=O
InChI Key InChIKey=JGHPTTVGCUEGGI-UHFFFAOYSA-N
Data  1 IC50
  Tab Delimited (TSV)   2D SDfile   Computed 3D by Vconf -m prep SDfile
Find this compound or compounds like it in BindingDB:
Activity Spreadsheet -- Enzyme Inhibition Constant Data from BindingDB
Found 1 hit for monomerid = 50273718
TargetFarnesyl pyrophosphate synthase(Homo sapiens (Human))
Universita Di Ferrara
Curated by ChEMBL
LigandPNGBDBM50273718(CHEMBL457424 | [2-(Purin-9-yl)ethyl]-bisphosphonic...)
Affinity DataIC50:  388nM. Assay description: Inhibition of human FPP synthase expressed in Escherichia coli BL21 (DE3)
In DepthDetails ArticlePubMed