BDBM50274679 CHEMBL4128530
SMILES C[C@@H](NC(=O)[C@@H](N)Cc1c(C)cc(O)cc1C)C(=O)N(C)[C@@H](Cc1ccccc1C=C)C(=O)NCC(N)=O
InChI Key InChIKey=QMSFTMNSMKWZSC-DKLXNKCPSA-N
Data  4 IC50  2 EC50
  Tab Delimited (TSV)   2D SDfile   Computed 3D by Vconf -m prep SDfile
Find this compound or compounds like it in BindingDB:
Activity Spreadsheet -- Enzyme Inhibition Constant Data from BindingDB
Found 6 hits for monomerid = 50274679
TargetDelta-type opioid receptor(MOUSE)
Vrije Universiteit Brussel
Curated by ChEMBL
LigandPNGBDBM50274679(CHEMBL4128530)
Affinity DataIC50:  0.689nM. Assay description: Agonist activity at delta-opioid receptor in mouse vasa deferens assessed as inhibition of electrically induced contractions
Ligand InfoPC cidPC sid
In DepthDetails ArticlePubMed
TargetDelta-type opioid receptor(MOUSE)
Vrije Universiteit Brussel
Curated by ChEMBL
LigandPNGBDBM50274679(CHEMBL4128530)
Affinity DataIC50:  59nM. Assay description: Displacement of [125I]-Deltorphin 2 from mouse Flag-tagged delta-opioid receptor expressed in HEK293 cell membranes after 60 mins by gamma counting
Ligand InfoPC cidPC sid
In DepthDetails ArticlePubMed
TargetMu-type opioid receptor(Rattus norvegicus (rat))
Vrije Universiteit Brussel
Curated by ChEMBL
LigandPNGBDBM50274679(CHEMBL4128530)
Affinity DataEC50:  0.00300nM. Assay description: Tested for thromboxane antagonist potency (pA2) against U 44619 induced platelet aggregation using human platelet rich plasma
Ligand InfoPC cidPC sid
In DepthDetails ArticlePubMed
TargetMu-type opioid receptor(MOUSE)
Vrije Universiteit Brussel
Curated by ChEMBL
LigandPNGBDBM50274679(CHEMBL4128530)
Affinity DataIC50:  0.360nM. Assay description: Displacement of [125I]-DAMGO from mouse Flag-tagged mu-opioid receptor expressed in HEK293 cell membranes after 60 mins by gamma counting
Ligand InfoPC cidPC sid
In DepthDetails ArticlePubMed
TargetDelta-type opioid receptor(Rattus norvegicus (rat))
Vrije Universiteit Brussel
Curated by ChEMBL
LigandPNGBDBM50274679(CHEMBL4128530)
Affinity DataEC50:  4.40nM. Assay description: Agonist activity at rat delta-opioid receptor expressed in HEK293 cells co-expressing Rluc2-EPAC-GFP10 biosenser assessed as inhibition of forskolin-...
Ligand InfoPC cidPC sid
In DepthDetails ArticlePubMed
TargetMu-type opioid receptor(GUINEA PIG)
Vrije Universiteit Brussel
Curated by ChEMBL
LigandPNGBDBM50274679(CHEMBL4128530)
Affinity DataIC50:  0.641nM. Assay description: Agonist activity at mu-opioid receptor in guinea pig ileum assessed as inhibition of electrically induced contractions
Ligand InfoPC cidPC sid
In DepthDetails ArticlePubMed