BDBM50277918 (R)-3-((3'-methoxybiphenyl-4-yl)methyl)-5-methyloxazolidin-2-one::CHEMBL485330
SMILES COc1cccc(c1)-c1ccc(CN2C[C@@H](C)OC2=O)cc1
InChI Key InChIKey=NDRUNWAMJQWAHZ-CYBMUJFWSA-N
Data  1 EC50
  Tab Delimited (TSV)   2D SDfile   Computed 3D by Vconf -m prep SDfile
Find this compound or compounds like it in BindingDB:
Activity Spreadsheet -- Enzyme Inhibition Constant Data from BindingDB
Found 1 hit for monomerid = 50277918
TargetMetabotropic glutamate receptor 2(Homo sapiens (Human))
Pfizer
Curated by ChEMBL
LigandPNGBDBM50277918((R)-3-((3'-methoxybiphenyl-4-yl)methyl)-5-methylox...)
Affinity DataEC50:  275nM. Assay description: Agonist activity at mGluR2 (unknown origin) expressed in HEK cells by FLIPR assay in presence of glutamate
In DepthDetails ArticlePubMed